Reaction Details
TargetNeuraminidase
LigandBDBM50371257
Substrate/Competitorn/a
Meas. Tech.ChEMBL_462436 (CHEMBL927252)
Ki 0.14±n/a nM
Citation Krueger, ACXu, YKati, WMKempf, DJMaring, CJMcDaniel, KFMolla, AMontgomery, DKohlbrenner, WE Synthesis of potent pyrrolidine influenza neuraminidase inhibitors. Bioorg Med Chem Lett18:1692-5 (2008) 
 
Neuraminidase
Name:Neuraminidase
Type:Enzyme
Mol. Mass.:51446.67
Organism:Influenza B virus (B/Lee/40)
Description:n/a
Residue:466
BDBM50371257
NameBDBM50371257
Synonyms:A-315675 | CHEMBL473062
TypeSmall organic molecule
Emp. Form.C17H30N2O4
Mol. Mass.326.4311
SMILESCCC[C@](C)(OC)[C@H](NC(C)=O)[C@@H]1N[C@H](C[C@H]1\C=C/C)C(O)=O