Reaction Details
TargetSodium channel protein type 9 subunit alpha
LigandBDBM50117271
Substrate/Competitorn/a
Meas. Tech.ChEMBL_462438 (CHEMBL927254)
IC50 11000±n/a nM
Citation London, CHoyt, SBParsons, WHWilliams, BSWarren, VATschirret-Guth, RSmith, MMPriest, BTMcGowan, EMartin, WJLyons, KALi, XKaranam, BVJochnowitz, NGarcia, MLFelix, JPDean, BAbbadie, CKaczorowski, GJDuffy, JL Imidazopyridines: a novel class of hNav1.7 channel blockers. Bioorg Med Chem Lett18:1696-701 (2008) 
 
Sodium channel protein type 9 subunit alpha
Name:Sodium channel protein type 9 subunit alpha
Type:Protein
Mol. Mass.:226375.97
Organism:Homo sapiens (Human)
Description:Q15858
Residue:1988
BDBM50117271
NameBDBM50117271
Synonyms:1-(2,6-dimethylphenoxy)-2-propanolamine 2-(2,6-Dimethyl-phenoxy)-1-methyl-ethylamine CHEMBL558 Mexitil
TypeSmall organic molecule
Emp. Form.C11H17NO
Mol. Mass.179.2588
SMILESCC(N)COc1c(C)cccc1C