Reaction Details
TargetC-C chemokine receptor type 2
LigandBDBM50371414
Substrate/Competitorn/a
Meas. Tech.ChEMBL_463346 (CHEMBL929489)
IC50 0.5±n/a nM
Citation Cherney, RJMo, RMeyer, DTNelson, DJLo, YCYang, GScherle, PAMandlekar, SWasserman, ZRJezak, HSolomon, KATebben, AJCarter, PHDecicco, CP Discovery of disubstituted cyclohexanes as a new class of CC chemokine receptor 2 antagonists. J Med Chem51:721-4 (2008) 
 
C-C chemokine receptor type 2
Name:C-C chemokine receptor type 2
Type:Enzyme
Mol. Mass.:41932.32
Organism:Homo sapiens (Human)
Description:P41597
Residue:374
BDBM50371414
NameBDBM50371414
Synonyms:CHEMBL271828
TypeSmall organic molecule
Emp. Form.C30H36F3N5O6S
Mol. Mass.651.697
SMILESNS(=O)(=O)c1ccc(cc1)C(=O)N[C@@H]1CCCC[C@@H]1NC(=O)CNC(=O)c1cc(ccc1NC(=O)C1CCCCC1)C(F)(F)F