Reaction Details
TargetFalcipain 2
LigandBDBM50371562
Substrate/Competitorn/a
Meas. Tech.ChEMBL_463775 (CHEMBL931126)
IC50 8000±n/a nM
Citation Ettari, RNizi, EDi Francesco, MEDude, MAPradel, GVicík, RSchirmeister, TMicale, NGrasso, SZappalà, M Development of peptidomimetics with a vinyl sulfone warhead as irreversible falcipain-2 inhibitors. J Med Chem51:988-96 (2008) 
 
Falcipain 2
Name:Falcipain 2
Type:Enzyme
Mol. Mass.:55912.60
Organism:Plasmodium falciparum
Description:Recombinant falcipain-2.
Residue:484
BDBM50371562
NameBDBM50371562
Synonyms:CHEMBL271992
TypeSmall organic molecule
Emp. Form.C36H30ClF3N4O7S
Mol. Mass.755.159
SMILESCOc1ccc(cc1)S(=O)(=O)C=CCNC(=O)CN1c2ccccc2C(=NC(COC(=O)Nc2ccc(Cl)cc2C(F)(F)F)C1=O)c1ccccc1