Reaction Details
TargetCathepsin B
LigandBDBM50371562
Substrate/Competitorn/a
Meas. Tech.ChEMBL_463777 (CHEMBL931128)
Ki 5900±n/a nM
Citation Ettari, RNizi, EDi Francesco, MEDude, MAPradel, GVicík, RSchirmeister, TMicale, NGrasso, SZappalà, M Development of peptidomimetics with a vinyl sulfone warhead as irreversible falcipain-2 inhibitors. J Med Chem51:988-96 (2008) 
 
Cathepsin B
Name:Cathepsin B
Type:Enzyme
Mol. Mass.:37819.69
Organism:Homo sapiens (Human)
Description:gi_63102437
Residue:339
BDBM50371562
NameBDBM50371562
Synonyms:CHEMBL271992
TypeSmall organic molecule
Emp. Form.C36H30ClF3N4O7S
Mol. Mass.755.159
SMILESCOc1ccc(cc1)S(=O)(=O)C=CCNC(=O)CN1c2ccccc2C(=NC(COC(=O)Nc2ccc(Cl)cc2C(F)(F)F)C1=O)c1ccccc1