Reaction Details
TargetCathepsin B
LigandBDBM50371567
Substrate/Competitorn/a
Meas. Tech.ChEMBL_463777 (CHEMBL931128)
Ki 4300±n/a nM
Citation Ettari, RNizi, EDi Francesco, MEDude, MAPradel, GVicík, RSchirmeister, TMicale, NGrasso, SZappalà, M Development of peptidomimetics with a vinyl sulfone warhead as irreversible falcipain-2 inhibitors. J Med Chem51:988-96 (2008) 
 
Cathepsin B
Name:Cathepsin B
Type:Enzyme
Mol. Mass.:37819.69
Organism:Homo sapiens (Human)
Description:gi_63102437
Residue:339
BDBM50371567
NameBDBM50371567
Synonyms:CHEMBL270278
TypeSmall organic molecule
Emp. Form.C31H28ClF3N4O6S
Mol. Mass.677.09
SMILESCCS(=O)(=O)C=CCNC(=O)CN1c2ccccc2C(=N[C@H](COC(=O)Nc2ccc(Cl)cc2C(F)(F)F)C1=O)c1ccccc1