Reaction Details
TargetCathepsin B
LigandBDBM50371566
Substrate/Competitorn/a
Meas. Tech.ChEMBL_463777 (CHEMBL931128)
Ki 11000±n/a nM
Citation Ettari, RNizi, EDi Francesco, MEDude, MAPradel, GVicík, RSchirmeister, TMicale, NGrasso, SZappalà, M Development of peptidomimetics with a vinyl sulfone warhead as irreversible falcipain-2 inhibitors. J Med Chem51:988-96 (2008) 
 
Cathepsin B
Name:Cathepsin B
Type:Enzyme
Mol. Mass.:37819.69
Organism:Homo sapiens (Human)
Description:gi_63102437
Residue:339
BDBM50371566
NameBDBM50371566
Synonyms:CHEMBL407354
TypeSmall organic molecule
Emp. Form.C30H26ClF3N4O6S
Mol. Mass.663.064
SMILESCS(=O)(=O)C=CCNC(=O)CN1c2ccccc2C(=N[C@H](COC(=O)Nc2ccc(Cl)cc2C(F)(F)F)C1=O)c1ccccc1