Reaction Details
TargetFalcipain 2
LigandBDBM50371565
Substrate/Competitorn/a
Meas. Tech.ChEMBL_463775 (CHEMBL931126)
IC50 8000±n/a nM
Citation Ettari, RNizi, EDi Francesco, MEDude, MAPradel, GVicík, RSchirmeister, TMicale, NGrasso, SZappalà, M Development of peptidomimetics with a vinyl sulfone warhead as irreversible falcipain-2 inhibitors. J Med Chem51:988-96 (2008) 
 
Falcipain 2
Name:Falcipain 2
Type:Enzyme
Mol. Mass.:55912.60
Organism:Plasmodium falciparum
Description:Recombinant falcipain-2.
Residue:484
BDBM50371565
NameBDBM50371565
Synonyms:CHEMBL402455
TypeSmall organic molecule
Emp. Form.C43H36ClF3N4O6S
Mol. Mass.829.282
SMILESFC(F)(F)c1cc(Cl)ccc1NC(=O)OC[C@H]1N=C(c2ccccc2)c2ccccc2N(CC(=O)N[C@@H](CCc2ccccc2)C=CS(=O)(=O)c2ccccc2)C1=O