Reaction Details
TargetB1 bradykinin receptor
LigandBDBM50371657
Substrate/Competitorn/a
Meas. Tech.ChEMBL_463823 (CHEMBL948902)
Ki 0.4±n/a nM
Citation Feng, DMDiPardo, RMWai, JMChang, RKDi Marco, CNMurphy, KLRansom, RWReiss, DRTang, CPrueksaritanont, TPettibone, DJBock, MGKuduk, SD A new class of bradykinin B1 receptor antagonists with high oral bioavailability and minimal PXR activity. Bioorg Med Chem Lett18:682-7 (2008) B1 bradykinin receptor
Name:B1 bradykinin receptor
Type:Enzyme
Mol. Mass.:40508.87
Organism:Homo sapiens (Human)
Description:P46663
Residue:353
BDBM50371657
NameBDBM50371657
Synonyms:CHEMBL404370
TypeSmall organic molecule
Emp. Form.C25H22Cl2FN3O6
Mol. Mass.550.363
SMILESCOC(=O)c1c(Cl)cc(Cl)cc1-c1ccc([C@@H](C)NC(=O)C2(CC2)NC(=O)c2cc(OC)no2)c(F)c1