Reaction Details
TargetC-X-C chemokine receptor type 2
LigandBDBM50371782
Substrate/Competitorn/a
Meas. Tech.ChEMBL_464067 (CHEMBL949060)
IC50 280±n/a nM
Citation Walters, IAustin, CAustin, RBonnert, RCage, PChristie, MEbden, MGardiner, SGrahames, CHill, SHunt, FJewell, RLewis, SMartin, IDavid Nicholls, naDavid Robinson, na Evaluation of a series of bicyclic CXCR2 antagonists. Bioorg Med Chem Lett18:798-803 (2008) C-X-C chemokine receptor type 2
Name:C-X-C chemokine receptor type 2
Type:Protein
Mol. Mass.:40767.88
Organism:Homo sapiens (Human)
Description:P25025
Residue:360
BDBM50371782
NameBDBM50371782
Synonyms:CHEMBL257659
TypeSmall organic molecule
Emp. Form.C17H17F2N5OS
Mol. Mass.377.412
SMILESC[C@H](CO)Nc1nc(SCc2cccc(F)c2F)nc2nc(C)cnc12