Reaction Details
TargetC-X-C chemokine receptor type 2
LigandBDBM50371784
Substrate/Competitorn/a
Meas. Tech.ChEMBL_464067 (CHEMBL949060)
IC50 1±n/a nM
Citation Walters, IAustin, CAustin, RBonnert, RCage, PChristie, MEbden, MGardiner, SGrahames, CHill, SHunt, FJewell, RLewis, SMartin, IDavid Nicholls, naDavid Robinson, na Evaluation of a series of bicyclic CXCR2 antagonists. Bioorg Med Chem Lett18:798-803 (2008) C-X-C chemokine receptor type 2
Name:C-X-C chemokine receptor type 2
Type:Protein
Mol. Mass.:40767.88
Organism:Homo sapiens (Human)
Description:P25025
Residue:360
BDBM50371784
NameBDBM50371784
Synonyms:CHEMBL446458
TypeSmall organic molecule
Emp. Form.C15H14F2N4O2S2
Mol. Mass.384.424
SMILESC[C@H](CO)Nc1[nH]c(SCc2cccc(F)c2F)nc2nc(=O)sc12