Reaction Details
TargetCocaine esterase
LigandBDBM50371961
Substrate/Competitorn/a
Meas. Tech.ChEMBL_464383 (CHEMBL930032)
IC50 11±n/a nM
Citation Wheelock, CENishi, KYing, AJones, PDColvin, MEOlmstead, MMHammock, BD Influence of sulfur oxidation state and steric bulk upon trifluoromethyl ketone (TFK) binding kinetics to carboxylesterases and fatty acid amide hydrolase (FAAH). Bioorg Med Chem16:2114-30 (2008) 
 
Cocaine esterase
Name:Cocaine esterase
Type:PROTEIN
Mol. Mass.:61801.08
Organism:Homo sapiens (Human)
Description:ChEMBL_1494240
Residue:559
BDBM50371961
NameBDBM50371961
Synonyms:CHEMBL270373
TypeSmall organic molecule
Emp. Form.C11H19F3O2S
Mol. Mass.272.328
SMILESCCCCCCCCS(=O)CC(=O)C(F)(F)F