Reaction Details
TargetFatty-acid amide hydrolase 1
LigandBDBM50371973
Substrate/Competitorn/a
Meas. Tech.ChEMBL_464390 (CHEMBL930039)
IC50>40000±n/a nM
Citation Wheelock, CENishi, KYing, AJones, PDColvin, MEOlmstead, MMHammock, BD Influence of sulfur oxidation state and steric bulk upon trifluoromethyl ketone (TFK) binding kinetics to carboxylesterases and fatty acid amide hydrolase (FAAH). Bioorg Med Chem16:2114-30 (2008) 
 
Fatty-acid amide hydrolase 1
Name:Fatty-acid amide hydrolase 1
Type:Protein
Mol. Mass.:63071.19
Organism:Homo sapiens (Human)
Description:O00519
Residue:579
BDBM50371973
NameBDBM50371973
Synonyms:CHEMBL402615
TypeSmall organic molecule
Emp. Form.C7H11F3OS
Mol. Mass.200.222
SMILESCCCCSCC(=O)C(F)(F)F