Reaction Details
TargetC-X-C chemokine receptor type 3
LigandBDBM50372004
Substrate/Competitorn/a
Meas. Tech.ChEMBL_464453 (CHEMBL948053)
Ki 95±n/a nM
Citation Knight, RLAllen, DRBirch, HLChapman, GAGalvin, FCJopling, LALock, CJMeissner, JWOwen, DARaphy, GWatson, RJWilliams, SC Development of CXCR3 antagonists. Part 4: discovery of 2-amino-(4-tropinyl)quinolines. Bioorg Med Chem Lett18:629-33 (2008) 
 
C-X-C chemokine receptor type 3
Name:C-X-C chemokine receptor type 3
Type:Enzyme Catalytic Domain
Mol. Mass.:40665.65
Organism:Homo sapiens (Human)
Description:n/a
Residue:368
BDBM50372004
NameBDBM50372004
Synonyms:CHEMBL258272
TypeSmall organic molecule
Emp. Form.C24H32N4OS
Mol. Mass.424.602
SMILESCN(C1CCN(CC2=CC3CCCC(C2)N3C(C)=O)CC1)c1nc2ccccc2s1