Reaction Details
TargetC-X-C chemokine receptor type 3
LigandBDBM50372005
Substrate/Competitorn/a
Meas. Tech.ChEMBL_464453 (CHEMBL948053)
Ki 6±n/a nM
Citation Knight, RLAllen, DRBirch, HLChapman, GAGalvin, FCJopling, LALock, CJMeissner, JWOwen, DARaphy, GWatson, RJWilliams, SC Development of CXCR3 antagonists. Part 4: discovery of 2-amino-(4-tropinyl)quinolines. Bioorg Med Chem Lett18:629-33 (2008) 
 
C-X-C chemokine receptor type 3
Name:C-X-C chemokine receptor type 3
Type:Enzyme Catalytic Domain
Mol. Mass.:40665.65
Organism:Homo sapiens (Human)
Description:n/a
Residue:368
BDBM50372005
NameBDBM50372005
Synonyms:CHEMBL429598
TypeSmall organic molecule
Emp. Form.C30H39FN4O2
Mol. Mass.506.6547
SMILESCC(C)Oc1cc(F)c2ccc(N[C@H]3C[C@@H]4CC[C@H](C3)N4CC3=CC4CCCC(C3)N4C(C)=O)nc2c1