Reaction Details
TargetC-X-C chemokine receptor type 3
LigandBDBM50372008
Substrate/Competitorn/a
Meas. Tech.ChEMBL_464453 (CHEMBL948053)
Ki 6±n/a nM
Citation Knight, RLAllen, DRBirch, HLChapman, GAGalvin, FCJopling, LALock, CJMeissner, JWOwen, DARaphy, GWatson, RJWilliams, SC Development of CXCR3 antagonists. Part 4: discovery of 2-amino-(4-tropinyl)quinolines. Bioorg Med Chem Lett18:629-33 (2008) 
 
C-X-C chemokine receptor type 3
Name:C-X-C chemokine receptor type 3
Type:Enzyme Catalytic Domain
Mol. Mass.:40665.65
Organism:Homo sapiens (Human)
Description:n/a
Residue:368
BDBM50372008
NameBDBM50372008
Synonyms:CHEMBL444542
TypeSmall organic molecule
Emp. Form.C28H33F3N4O2
Mol. Mass.514.5824
SMILESCC(=O)N1C2CCCC1C=C(CN1[C@H]3CC[C@@H]1C[C@H](C3)Nc1ccc3cc(OC(F)(F)F)ccc3n1)C2