Reaction Details
TargetC-X-C chemokine receptor type 3
LigandBDBM50372016
Substrate/Competitorn/a
Meas. Tech.ChEMBL_464453 (CHEMBL948053)
Ki 135±n/a nM
Citation Knight, RLAllen, DRBirch, HLChapman, GAGalvin, FCJopling, LALock, CJMeissner, JWOwen, DARaphy, GWatson, RJWilliams, SC Development of CXCR3 antagonists. Part 4: discovery of 2-amino-(4-tropinyl)quinolines. Bioorg Med Chem Lett18:629-33 (2008) 
 
C-X-C chemokine receptor type 3
Name:C-X-C chemokine receptor type 3
Type:Enzyme Catalytic Domain
Mol. Mass.:40665.65
Organism:Homo sapiens (Human)
Description:n/a
Residue:368
BDBM50372016
NameBDBM50372016
Synonyms:CHEMBL402044
TypeSmall organic molecule
Emp. Form.C25H32N4O
Mol. Mass.404.5478
SMILESCC(=O)N1C2CCCC1C=C(CN1CCC(CC1)Nc1ccc3ccccc3n1)C2