Reaction Details
TargetC-X-C chemokine receptor type 3
LigandBDBM50225711
Substrate/Competitorn/a
Meas. Tech.ChEMBL_464453 (CHEMBL948053)
Ki 126±n/a nM
Citation Knight, RLAllen, DRBirch, HLChapman, GAGalvin, FCJopling, LALock, CJMeissner, JWOwen, DARaphy, GWatson, RJWilliams, SC Development of CXCR3 antagonists. Part 4: discovery of 2-amino-(4-tropinyl)quinolines. Bioorg Med Chem Lett18:629-33 (2008) 
 
C-X-C chemokine receptor type 3
Name:C-X-C chemokine receptor type 3
Type:Enzyme Catalytic Domain
Mol. Mass.:40665.65
Organism:Homo sapiens (Human)
Description:n/a
Residue:368
BDBM50225711
NameBDBM50225711
Synonyms:CHEMBL437776 | N-(1-(((1R,5S)-6,6-dimethylbicyclo[3.1.1]hept-2-en-2-yl)methyl)piperidin-4-yl)-N-methylbenzo[d]thiazol-2-amine
TypeSmall organic molecule
Emp. Form.C23H31N3S
Mol. Mass.381.577
SMILESCN(C1CCN(CC2=CC[C@H]3C[C@@H]2C3(C)C)CC1)c1nc2ccccc2s1