Reaction Details
TargetNeutrophil elastase
LigandBDBM50235611
Substrate/Competitorn/a
Meas. Tech.ChEMBL_464663 (CHEMBL933922)
Ki 63500±n/a nM
Citation Mulchande, JGuedes, RCTsang, WYPage, MIMoreira, RIley, J Azetidine-2,4-diones (4-oxo-beta-lactams) as scaffolds for designing elastase inhibitors. J Med Chem51:1783-90 (2008) 
 
Neutrophil elastase
Name:Neutrophil elastase
Type:Enzyme
Mol. Mass.:28532.38
Organism:Homo sapiens (Human)
Description:P08246
Residue:267
BDBM50235611
NameBDBM50235611
Synonyms:4-(3,3-diethyl-2,4-dioxoazetidin-1-yl)benzonitrile | CHEMBL272394
TypeSmall organic molecule
Emp. Form.C14H14N2O2
Mol. Mass.242.2732
SMILESCCC1(CC)C(=O)N(C1=O)c1ccc(cc1)C#N