Reaction Details
TargetProthrombin
LigandBDBM50372030
Substrate/Competitorn/a
Meas. Tech.ChEMBL_464664 (CHEMBL933925)
Ki 1.2±n/a nM
Citation Isaacs, RCSolinsky, MGCutrona, KJNewton, CLNaylor-Olsen, AMMcMasters, DRKrueger, JALewis, SDLucas, BJKuo, LCYan, YLynch, JJLyle, EA Structure-based design of novel groups for use in the P1 position of thrombin inhibitor scaffolds. Part 2: N-acetamidoimidazoles. Bioorg Med Chem Lett18:2062-6 (2008) 
 
Prothrombin
Name:Prothrombin
Type:Protein
Mol. Mass.:70029.57
Organism:Homo sapiens (Human)
Description:P00734
Residue:622
BDBM50372030
NameBDBM50372030
Synonyms:CHEMBL273026
TypeSmall organic molecule
Emp. Form.C27H36N8O3
Mol. Mass.520.6265
SMILESCc1ncn(CC(=O)NC2CCCNC2)c1CNC(=O)Cn1c(C)cnc(NCCc2ccccc2)c1=O