Reaction Details
TargetProthrombin
LigandBDBM50372039
Substrate/Competitorn/a
Meas. Tech.ChEMBL_464664 (CHEMBL933925)
Ki 0.31±n/a nM
Citation Isaacs, RCSolinsky, MGCutrona, KJNewton, CLNaylor-Olsen, AMMcMasters, DRKrueger, JALewis, SDLucas, BJKuo, LCYan, YLynch, JJLyle, EA Structure-based design of novel groups for use in the P1 position of thrombin inhibitor scaffolds. Part 2: N-acetamidoimidazoles. Bioorg Med Chem Lett18:2062-6 (2008) 
 
Prothrombin
Name:Prothrombin
Type:Protein
Mol. Mass.:70029.57
Organism:Homo sapiens (Human)
Description:P00734
Residue:622
BDBM50372039
NameBDBM50372039
Synonyms:CHEMBL402095
TypeSmall organic molecule
Emp. Form.C25H32N6O4S
Mol. Mass.512.624
SMILESCc1ncn(CC(=O)NC2CCCNC2)c1Cn1c(C)ccc(NS(=O)(=O)Cc2ccccc2)c1=O