Reaction Details
TargetBcl-2-like protein 2
LigandBDBM50202277
Substrate/Competitorn/a
Meas. Tech.ChEMBL_464768 (CHEMBL930134)
Ki 21500±n/a nM
Citation Wang, LKong, FKokoski, CLAndrews, DWXing, C Development of dimeric modulators for anti-apoptotic Bcl-2 proteins. Bioorg Med Chem Lett18:236-40 (2008) 
 
Bcl-2-like protein 2
Name:Bcl-2-like protein 2
Type:Protein
Mol. Mass.:20742.61
Organism:Homo sapiens (Human)
Description:n/a
Residue:193
BDBM50202277
NameBDBM50202277
Synonyms:(S)-2-(5-(4-bromobenzylidene)-4-oxo-2-thioxothiazolidin-3-yl)-3-phenylpropanoic acid CHEMBL243190 | Thiazolidinone core, 24
TypeSmall organic molecule
Emp. Form.C19H14BrNO3S2
Mol. Mass.448.353
SMILESOC(=O)[C@H](Cc1ccccc1)N1C(=S)S\C(=C/c2ccc(Br)cc2)C1=O