Reaction Details
TargetBcl-2-like protein 2
LigandBDBM50372180
Substrate/Competitorn/a
Meas. Tech.ChEMBL_464768 (CHEMBL930134)
Ki 2200±n/a nM
Citation Wang, LKong, FKokoski, CLAndrews, DWXing, C Development of dimeric modulators for anti-apoptotic Bcl-2 proteins. Bioorg Med Chem Lett18:236-40 (2008) 
 
Bcl-2-like protein 2
Name:Bcl-2-like protein 2
Type:Protein
Mol. Mass.:20742.61
Organism:Homo sapiens (Human)
Description:n/a
Residue:193
BDBM50372180
NameBDBM50372180
Synonyms:CHEMBL270646
TypeSmall organic molecule
Emp. Form.C42H36N2O9S4
Mol. Mass.841.003
SMILESOC(=O)[C@H](Cc1ccccc1)N1C(=S)S\C(=C/c2ccc(OCCOCCOc3ccc(\C=C4/SC(=S)N([C@@H](Cc5ccccc5)C(O)=O)C4=O)cc3)cc2)C1=O