Reaction Details
TargetNociceptin receptor
LigandBDBM50372278
Substrate/Competitorn/a
Meas. Tech.ChEMBL_464838 (CHEMBL930555)
IC50 0.79±n/a nM
Citation Li, JIsozaki, KOkada, KMatsushima, ANose, TCosta, TShimohigashi, Y Designed modification of partial agonist of ORL1 nociceptin receptor for conversion into highly potent antagonist. Bioorg Med Chem16:2635-44 (2008) 
 
Nociceptin receptor
Name:Nociceptin receptor
Type:G Protein-Coupled Receptor (GPCR)
Mol. Mass.:40702.87
Organism:Homo sapiens (Human)
Description:P41146
Residue:370
BDBM50372278
NameBDBM50372278
Synonyms:CHEMBL256055
TypeSmall organic molecule
Emp. Form.C44H70N14O8
Mol. Mass.923.1156
SMILES[#6]-[#6]-[#6@H](-[#6])-[#6@H](-[#7]-[#6](=O)-[#6@H](-[#6]-[#6]-[#6]\[#7]=[#6](/[#7])-[#7])-[#7]-[#6](=O)-[#6@H](-[#6]-c1ccc(-[#8])cc1)-[#7]-[#6](=O)-[#6@H](-[#6]-c1ccccc1)-[#7]-[#6](=O)-[#6@H](-[#6]-[#6]-[#6]\[#7]=[#6](\[#7])-[#7])-[#7]-[#6](-[#6])=O)-[#6](=O)-[#7]-[#6@@H](-[#6]-[#6]-[#6]-[#6]-[#7])-[#6](-[#7])=O