Reaction Details
TargetNociceptin receptor
LigandBDBM50372279
Substrate/Competitorn/a
Meas. Tech.ChEMBL_464839 (CHEMBL930556)
EC50 23.3±n/a nM
Citation Li, JIsozaki, KOkada, KMatsushima, ANose, TCosta, TShimohigashi, Y Designed modification of partial agonist of ORL1 nociceptin receptor for conversion into highly potent antagonist. Bioorg Med Chem16:2635-44 (2008) 
 
Nociceptin receptor
Name:Nociceptin receptor
Type:G Protein-Coupled Receptor (GPCR)
Mol. Mass.:40702.87
Organism:Homo sapiens (Human)
Description:P41146
Residue:370
BDBM50372279
NameBDBM50372279
Synonyms:CHEMBL271478
TypeSmall organic molecule
Emp. Form.C43H68N14O8
Mol. Mass.909.089
SMILES[#6]-[#6]-[#6@H](-[#6])-[#6@H](-[#7]-[#6](=O)-[#6@H](-[#6]-[#6]-[#6]\[#7]=[#6](/[#7])-[#7])-[#7]-[#6](=O)-[#6@H](-[#6]-c1ccc(-[#8])cc1)-[#7]-[#6](=O)-[#6@H](-[#6]-c1ccccc1)-[#7]-[#6](=O)-[#6@H](-[#6]-[#6]-[#6]\[#7]=[#6](\[#7])-[#7])-[#7]-[#6]=O)-[#6](=O)-[#7]-[#6@@H](-[#6]-[#6]-[#6]-[#6]-[#7])-[#6](-[#7])=O