Reaction Details
TargetHistone deacetylase 1
LigandBDBM50216024
Substrate/Competitorn/a
Meas. Tech.ChEMBL_464922 (CHEMBL946979)
IC50 672±n/a nM
Citation Paris, MPorcelloni, MBinaschi, MFattori, D Histone deacetylase inhibitors: from bench to clinic. J Med Chem51:1505-29 (2008) 
 
Histone deacetylase 1
Name:Histone deacetylase 1
Type:Enzyme
Mol. Mass.:55090.27
Organism:Homo sapiens (Human)
Description:Q13547
Residue:482
BDBM50216024
NameBDBM50216024
Synonyms:CHEMBL245946 | N-hydroxybenzo[b]thiophene-2-carboxamide
TypeSmall organic molecule
Emp. Form.C9H7NO2S
Mol. Mass.193.222
SMILESONC(=O)c1cc2ccccc2s1