Reaction Details
TargetHistone deacetylase 1
LigandBDBM50372431
Substrate/Competitorn/a
Meas. Tech.ChEMBL_464922 (CHEMBL946979)
IC50 1060±n/a nM
Citation Paris, MPorcelloni, MBinaschi, MFattori, D Histone deacetylase inhibitors: from bench to clinic. J Med Chem51:1505-29 (2008) 
 
Histone deacetylase 1
Name:Histone deacetylase 1
Type:Enzyme
Mol. Mass.:55090.27
Organism:Homo sapiens (Human)
Description:Q13547
Residue:482
BDBM50372431
NameBDBM50372431
Synonyms:CHEMBL261829
TypeSmall organic molecule
Emp. Form.C20H14N2O3S
Mol. Mass.362.402
SMILESONC(=O)c1cc2cc(NC(=O)c3cccc4ccccc34)ccc2s1