Reaction Details
TargetHistone deacetylase 8
LigandBDBM50157884
Substrate/Competitorn/a
Meas. Tech.ChEMBL_464936 (CHEMBL946993)
IC50 3890±n/a nM
Citation Paris, MPorcelloni, MBinaschi, MFattori, D Histone deacetylase inhibitors: from bench to clinic. J Med Chem51:1505-29 (2008) 
 
Histone deacetylase 8
Name:Histone deacetylase 8
Type:Enzyme
Mol. Mass.:41749.60
Organism:Homo sapiens (Human)
Description:Q9BY41
Residue:377
BDBM50157884
NameBDBM50157884
Synonyms:6-(2-Mercapto-acetylamino)-hexanoic acid phenylamide CHEMBL178727
TypeSmall organic molecule
Emp. Form.C14H20N2O2S
Mol. Mass.280.386
SMILESSCC(=O)NCCCCCC(=O)Nc1ccccc1