Reaction Details
TargetHistone deacetylase 1
LigandBDBM50372440
Substrate/Competitorn/a
Meas. Tech.ChEMBL_464969 (CHEMBL947141)
EC50 5000±n/a nM
Citation Paris, MPorcelloni, MBinaschi, MFattori, D Histone deacetylase inhibitors: from bench to clinic. J Med Chem51:1505-29 (2008) 
 
Histone deacetylase 1
Name:Histone deacetylase 1
Type:Enzyme
Mol. Mass.:55090.27
Organism:Homo sapiens (Human)
Description:Q13547
Residue:482
BDBM50372440
NameBDBM50372440
Synonyms:CHEMBL260957
TypeSmall organic molecule
Emp. Form.C25H28N4O2
Mol. Mass.416.5154
SMILESNc1ccccc1NC(=O)CCCCCCNC(=O)c1ccc(nc1)-c1ccccc1