Reaction Details
TargetHistone deacetylase 1
LigandBDBM50372446
Substrate/Competitorn/a
Meas. Tech.ChEMBL_464918 (CHEMBL946975)
IC50 55±n/a nM
Citation Paris, MPorcelloni, MBinaschi, MFattori, D Histone deacetylase inhibitors: from bench to clinic. J Med Chem51:1505-29 (2008) 
 
Histone deacetylase 1
Name:Histone deacetylase 1
Type:Enzyme
Mol. Mass.:55090.27
Organism:Homo sapiens (Human)
Description:Q13547
Residue:482
BDBM50372446
NameBDBM50372446
Synonyms:CHEMBL272401
TypeSmall organic molecule
Emp. Form.C24H34N4O2S
Mol. Mass.442.617
SMILESCN1CCCCC1N[C@@H](CCCCCC(C)=O)C(=O)Nc1nc(cs1)-c1ccccc1