Reaction Details
TargetHistone deacetylase 1
LigandBDBM50372451
Substrate/Competitorn/a
Meas. Tech.ChEMBL_464922 (CHEMBL946979)
IC50 9.5±n/a nM
Citation Paris, MPorcelloni, MBinaschi, MFattori, D Histone deacetylase inhibitors: from bench to clinic. J Med Chem51:1505-29 (2008) 
 
Histone deacetylase 1
Name:Histone deacetylase 1
Type:Enzyme
Mol. Mass.:55090.27
Organism:Homo sapiens (Human)
Description:Q13547
Residue:482
BDBM50372451
NameBDBM50372451
Synonyms:CHEMBL270739
TypeSmall organic molecule
Emp. Form.C25H26N6O5S2
Mol. Mass.554.641
SMILESONC(=O)CCCCCC(=O)N(CC(=O)Nc1nc2ccccc2s1)CC(=O)Nc1nc2ccccc2s1