Reaction Details
TargetHistone deacetylase 1
LigandBDBM50187098
Substrate/Competitorn/a
Meas. Tech.ChEMBL_464918 (CHEMBL946975)
IC50 4000±n/a nM
Citation Paris, MPorcelloni, MBinaschi, MFattori, D Histone deacetylase inhibitors: from bench to clinic. J Med Chem51:1505-29 (2008) 
 
Histone deacetylase 1
Name:Histone deacetylase 1
Type:Enzyme
Mol. Mass.:55090.27
Organism:Homo sapiens (Human)
Description:Q13547
Residue:482
BDBM50187098
NameBDBM50187098
Synonyms:4-(3,4-dimethoxybenzylamino)-N-(2-aminophenyl)benzamide | CHEMBL384503
TypeSmall organic molecule
Emp. Form.C22H23N3O3
Mol. Mass.377.4363
SMILESCOc1ccc(CNc2ccc(cc2)C(=O)Nc2ccccc2N)cc1OC