Reaction Details
TargetHistone deacetylase 8
LigandBDBM50372461
Substrate/Competitorn/a
Meas. Tech.ChEMBL_464919 (CHEMBL946976)
IC50 41±n/a nM
Citation Paris, MPorcelloni, MBinaschi, MFattori, D Histone deacetylase inhibitors: from bench to clinic. J Med Chem51:1505-29 (2008) 
 
Histone deacetylase 8
Name:Histone deacetylase 8
Type:Enzyme
Mol. Mass.:41749.60
Organism:Homo sapiens (Human)
Description:Q9BY41
Residue:377
BDBM50372461
NameBDBM50372461
Synonyms:CHEMBL270887
TypeSmall organic molecule
Emp. Form.C17H15N3O3S2
Mol. Mass.373.449
SMILESONC(=O)Cc1ccc(s1)-c1csc(NC(=O)Cc2ccccc2)n1