Reaction Details
TargetHistone deacetylase 1
LigandBDBM50195121
Substrate/Competitorn/a
Meas. Tech.ChEMBL_464922 (CHEMBL946979)
IC50 590±n/a nM
Citation Paris, MPorcelloni, MBinaschi, MFattori, D Histone deacetylase inhibitors: from bench to clinic. J Med Chem51:1505-29 (2008) 
 
Histone deacetylase 1
Name:Histone deacetylase 1
Type:Enzyme
Mol. Mass.:55090.27
Organism:Homo sapiens (Human)
Description:Q13547
Residue:482
BDBM50195121
NameBDBM50195121
Synonyms:(S)-2-(2-(5-methoxy-2-methyl-1H-indol-3-yl)acetamido)-8-oxo-N-(2-(2-phenyl-1H-indol-3-yl)ethyl)nonanamide | CHEMBL412598
TypeSmall organic molecule
Emp. Form.C37H42N4O4
Mol. Mass.606.7538
SMILESCOc1ccc2[nH]c(C)c(CC(=O)N[C@@H](CCCCCC(C)=O)C(=O)NCCc3c([nH]c4ccccc34)-c3ccccc3)c2c1