Reaction Details
TargetHistone deacetylase 2
LigandBDBM50372446
Substrate/Competitorn/a
Meas. Tech.ChEMBL_464924 (CHEMBL946981)
IC50 170±n/a nM
Citation Paris, MPorcelloni, MBinaschi, MFattori, D Histone deacetylase inhibitors: from bench to clinic. J Med Chem51:1505-29 (2008) 
 
Histone deacetylase 2
Name:Histone deacetylase 2
Type:Chromatin regulator; hydrolase; repressor
Mol. Mass.:55356.54
Organism:Homo sapiens (Human)
Description:Q92769
Residue:488
BDBM50372446
NameBDBM50372446
Synonyms:CHEMBL272401
TypeSmall organic molecule
Emp. Form.C24H34N4O2S
Mol. Mass.442.617
SMILESCN1CCCCC1N[C@@H](CCCCCC(C)=O)C(=O)Nc1nc(cs1)-c1ccccc1