Reaction Details
TargetHistone deacetylase 1
LigandBDBM50372466
Substrate/Competitorn/a
Meas. Tech.ChEMBL_464922 (CHEMBL946979)
IC50 480±n/a nM
Citation Paris, MPorcelloni, MBinaschi, MFattori, D Histone deacetylase inhibitors: from bench to clinic. J Med Chem51:1505-29 (2008) 
 
Histone deacetylase 1
Name:Histone deacetylase 1
Type:Enzyme
Mol. Mass.:55090.27
Organism:Homo sapiens (Human)
Description:Q13547
Residue:482
BDBM50372466
NameBDBM50372466
Synonyms:CHEMBL272840
TypeSmall organic molecule
Emp. Form.C28H31N5O3S
Mol. Mass.517.642
SMILESCC(=O)CCCCC[C@H](NC(=O)c1cnns1)C(=O)NCCc1c([nH]c2ccccc12)-c1ccccc1