Reaction Details
TargetHistone deacetylase 1
LigandBDBM50372455
Substrate/Competitorn/a
Meas. Tech.ChEMBL_464968 (CHEMBL947140)
IC50 720±n/a nM
Citation Paris, MPorcelloni, MBinaschi, MFattori, D Histone deacetylase inhibitors: from bench to clinic. J Med Chem51:1505-29 (2008) 
 
Histone deacetylase 1
Name:Histone deacetylase 1
Type:Enzyme
Mol. Mass.:55090.27
Organism:Homo sapiens (Human)
Description:Q13547
Residue:482
BDBM50372455
NameBDBM50372455
Synonyms:CHEMBL272403
TypeSmall organic molecule
Emp. Form.C24H27N3O2S
Mol. Mass.421.555
SMILESCC(=O)CCCCC[C@H](Nc1cncs1)C(=O)Nc1cccc(c1)-c1ccccc1