Reaction Details
TargetHistone deacetylase 1
LigandBDBM50195132
Substrate/Competitorn/a
Meas. Tech.ChEMBL_464968 (CHEMBL947140)
IC50 2000±n/a nM
Citation Paris, MPorcelloni, MBinaschi, MFattori, D Histone deacetylase inhibitors: from bench to clinic. J Med Chem51:1505-29 (2008) 
 
Histone deacetylase 1
Name:Histone deacetylase 1
Type:Enzyme
Mol. Mass.:55090.27
Organism:Homo sapiens (Human)
Description:Q13547
Residue:482
BDBM50195132
NameBDBM50195132
Synonyms:CHEMBL387015 | N-((S)-1,8-dioxo-1-(2-(2-phenyl-1H-indol-3-yl)ethylamino)nonan-2-yl)-1-methylpyrrolidine-3-carboxamide
TypeSmall organic molecule
Emp. Form.C31H40N4O3
Mol. Mass.516.6743
SMILESCN1CCC(C1)C(=O)N[C@@H](CCCCCC(C)=O)C(=O)NCCc1c([nH]c2ccccc12)-c1ccccc1