Reaction Details
TargetHistone deacetylase 8
LigandBDBM19423
Substrate/Competitorn/a
Meas. Tech.ChEMBL_464919 (CHEMBL946976)
IC50>20000±n/a nM
Citation Paris, MPorcelloni, MBinaschi, MFattori, D Histone deacetylase inhibitors: from bench to clinic. J Med Chem51:1505-29 (2008) 
 
Histone deacetylase 8
Name:Histone deacetylase 8
Type:Enzyme
Mol. Mass.:41749.60
Organism:Homo sapiens (Human)
Description:Q9BY41
Residue:377
BDBM19423
NameBDBM19423
Synonyms:HDAC inhibitor, Compound 1 N-[2-amino-5-(thiophen-2-yl)phenyl]-4-acetamidobenzamide (60) benzamide-type inhibitor, 19
TypeSmall organic molecule
Emp. Form.C19H17N3O2S
Mol. Mass.351.422
SMILESCC(=O)Nc1ccc(cc1)C(=O)Nc1cc(ccc1N)-c1cccs1