Reaction Details
TargetHistone deacetylase 8
LigandBDBM50372469
Substrate/Competitorn/a
Meas. Tech.ChEMBL_464919 (CHEMBL946976)
IC50 3700±n/a nM
Citation Paris, MPorcelloni, MBinaschi, MFattori, D Histone deacetylase inhibitors: from bench to clinic. J Med Chem51:1505-29 (2008) 
 
Histone deacetylase 8
Name:Histone deacetylase 8
Type:Enzyme
Mol. Mass.:41749.60
Organism:Homo sapiens (Human)
Description:Q9BY41
Residue:377
BDBM50372469
NameBDBM50372469
Synonyms:AZUMAMIDE E
TypeSmall organic molecule
Emp. Form.C27H38N4O6
Mol. Mass.514.6138
SMILESCC(C)[C@H]1NC(=O)[C@@H](C)[C@@H](CC=CCCC(O)=O)NC(=O)[C@@H](Cc2ccccc2)NC(=O)[C@@H](C)NC1=O