Reaction Details
TargetSigma non-opioid intracellular receptor 1
LigandBDBM50372600
Substrate/Competitorn/a
Meas. Tech.ChEMBL_465416 (CHEMBL946000)
Ki 0.37±n/a nM
Citation Nahas, RILever, JRLever, SZ Synthesis and structure-activity relationships of N-(3-phenylpropyl)-N'-benzylpiperazines: Potent ligands for sigma1 and sigma2 receptors. Bioorg Med Chem16:755-61 (2008) 
 
Sigma non-opioid intracellular receptor 1
Name:Sigma non-opioid intracellular receptor 1
Type:Protein
Mol. Mass.:25307.17
Organism:Cavia porcellus (Guinea pig)
Description:Q60492
Residue:223
BDBM50372600
NameBDBM50372600
Synonyms:CHEMBL414138
TypeSmall organic molecule
Emp. Form.C20H25N3O2
Mol. Mass.339.4314
SMILES[O-][N+](=O)c1ccc(CN2CCN(CCCc3ccccc3)CC2)cc1