Reaction Details
TargetC-C chemokine receptor type 3
LigandBDBM50372836
Substrate/Competitorn/a
Meas. Tech.ChEMBL_465933 (CHEMBL947057)
IC50 0.5±n/a nM
Citation Santella, JBGardner, DSYao, WShi, CReddy, PTebben, AJDeLucca, GVWacker, DAWatson, PSWelch, PKWadman, EADavies, PSolomon, KAGraden, DMYeleswaram, SMandlekar, SKariv, IDecicco, CPKo, SSCarter, PHDuncia, JV From rigid cyclic templates to conformationally stabilized acyclic scaffolds. Part I: the discovery of CCR3 antagonist development candidate BMS-639623 with picomolar inhibition potency against eosinophil chemotaxis. Bioorg Med Chem Lett18:576-85 (2008) 
 
C-C chemokine receptor type 3
Name:C-C chemokine receptor type 3
Type:Enzyme
Mol. Mass.:41053.88
Organism:Homo sapiens (Human)
Description:P51677
Residue:355
BDBM50372836
NameBDBM50372836
Synonyms:CHEMBL402331
TypeSmall organic molecule
Emp. Form.C27H35FN8O3
Mol. Mass.538.617
SMILESCNC(=O)O[C@H](C[C@@H](C)NC(=O)Nc1cccc(c1)-c1nnnn1C)N1CCC[C@@H](Cc2ccc(F)cc2)C1