Reaction Details
TargetCytochrome P450 2D6
LigandBDBM50372837
Substrate/Competitorn/a
Meas. Tech.ChEMBL_465935 (CHEMBL947059)
IC50 1500±n/a nM
Citation Santella, JBGardner, DSYao, WShi, CReddy, PTebben, AJDeLucca, GVWacker, DAWatson, PSWelch, PKWadman, EADavies, PSolomon, KAGraden, DMYeleswaram, SMandlekar, SKariv, IDecicco, CPKo, SSCarter, PHDuncia, JV From rigid cyclic templates to conformationally stabilized acyclic scaffolds. Part I: the discovery of CCR3 antagonist development candidate BMS-639623 with picomolar inhibition potency against eosinophil chemotaxis. Bioorg Med Chem Lett18:576-85 (2008) 
 
Cytochrome P450 2D6
Name:Cytochrome P450 2D6
Type:Protein
Mol. Mass.:55774.82
Organism:Homo sapiens (Human)
Description:P10635
Residue:497
BDBM50372837
NameBDBM50372837
Synonyms:CHEMBL429846
TypeSmall organic molecule
Emp. Form.C29H32FN5O4
Mol. Mass.533.5939
SMILESC[C@H](C[C@@H](O)N1CCC[C@@H](Cc2ccc(F)cc2)C1)NC(=O)Nc1cc(cc(c1)-c1ccon1)-c1ccon1