Reaction Details
TargetCytochrome P450 2D6
LigandBDBM50231358
Substrate/Competitorn/a
Meas. Tech.ChEMBL_465935 (CHEMBL947059)
IC50 2600±n/a nM
Citation Santella, JBGardner, DSYao, WShi, CReddy, PTebben, AJDeLucca, GVWacker, DAWatson, PSWelch, PKWadman, EADavies, PSolomon, KAGraden, DMYeleswaram, SMandlekar, SKariv, IDecicco, CPKo, SSCarter, PHDuncia, JV From rigid cyclic templates to conformationally stabilized acyclic scaffolds. Part I: the discovery of CCR3 antagonist development candidate BMS-639623 with picomolar inhibition potency against eosinophil chemotaxis. Bioorg Med Chem Lett18:576-85 (2008) 
 
Cytochrome P450 2D6
Name:Cytochrome P450 2D6
Type:Protein
Mol. Mass.:55774.82
Organism:Homo sapiens (Human)
Description:P10635
Residue:497
BDBM50231358
NameBDBM50231358
Synonyms:1-((2R,3S)-4-((S)-3-(4-fluorobenzyl)piperidin-1-yl)-3-hydroxybutan-2-yl)-3-(3-(1-methyl-1H-tetrazol-5-yl)phenyl)urea BMS-639623 | CHEMBL399495
TypeSmall organic molecule
Emp. Form.C25H32FN7O2
Mol. Mass.481.5657
SMILESC[C@@H](NC(=O)Nc1cccc(c1)-c1nnnn1C)[C@@H](O)CN1CCC[C@@H](Cc2ccc(F)cc2)C1