Reaction Details
TargetProbable C-C chemokine receptor type 3
LigandBDBM50231358
Substrate/Competitorn/a
Meas. Tech.ChEMBL_465950 (CHEMBL947074)
IC50 31±n/a nM
Citation Santella, JBGardner, DSYao, WShi, CReddy, PTebben, AJDeLucca, GVWacker, DAWatson, PSWelch, PKWadman, EADavies, PSolomon, KAGraden, DMYeleswaram, SMandlekar, SKariv, IDecicco, CPKo, SSCarter, PHDuncia, JV From rigid cyclic templates to conformationally stabilized acyclic scaffolds. Part I: the discovery of CCR3 antagonist development candidate BMS-639623 with picomolar inhibition potency against eosinophil chemotaxis. Bioorg Med Chem Lett18:576-85 (2008) 
 
Probable C-C chemokine receptor type 3
Name:Probable C-C chemokine receptor type 3
Type:PROTEIN
Mol. Mass.:41791.57
Organism:Mus musculus
Description:ChEMBL_1445729
Residue:359
BDBM50231358
NameBDBM50231358
Synonyms:1-((2R,3S)-4-((S)-3-(4-fluorobenzyl)piperidin-1-yl)-3-hydroxybutan-2-yl)-3-(3-(1-methyl-1H-tetrazol-5-yl)phenyl)urea BMS-639623 | CHEMBL399495
TypeSmall organic molecule
Emp. Form.C25H32FN7O2
Mol. Mass.481.5657
SMILESC[C@@H](NC(=O)Nc1cccc(c1)-c1nnnn1C)[C@@H](O)CN1CCC[C@@H](Cc2ccc(F)cc2)C1