Reaction Details
TargetcAMP-specific 3',5'-cyclic phosphodiesterase 4B
LigandBDBM14361
Substrate/Competitorn/a
Meas. Tech.ChEMBL_466144 (CHEMBL934504)
IC50 2000±n/a nM
Citation Irvine, MWPatrick, GLKewney, JHastings, SFMacKenzie, SJ Rhodanine derivatives as novel inhibitors of PDE4. Bioorg Med Chem Lett18:2032-7 (2008) 
 
cAMP-specific 3',5'-cyclic phosphodiesterase 4B
Name:cAMP-specific 3',5'-cyclic phosphodiesterase 4B
Type:Protein
Mol. Mass.:83318.87
Organism:Homo sapiens (Human)
Description:Q07343
Residue:736
BDBM14361
NameBDBM14361
Synonyms:(R,S)-Rolipram 4-[3-(cyclopentyloxy)-4-methoxyphenyl]pyrrolidin-2-one CHEMBL63 | Rolipram
TypeSmall organic molecule
Emp. Form.C16H21NO3
Mol. Mass.275.3428
SMILESCOc1ccc(cc1OC1CCCC1)C1CNC(=O)C1