Reaction Details
TargetSodium-dependent dopamine transporter
LigandBDBM50373030
Substrate/Competitorn/a
Meas. Tech.ChEMBL_466324 (CHEMBL947041)
Ki>30000±n/a nM
Citation Zeng, FJarkas, NStehouwer, JSVoll, RJOwens, MJKilts, CDNemeroff, CBGoodman, MM Synthesis, in vitro characterization, and radiolabeling of reboxetine analogs as potential PET radioligands for imaging the norepinephrine transporter. Bioorg Med Chem16:783-93 (2008) 
 
Sodium-dependent dopamine transporter
Name:Sodium-dependent dopamine transporter
Type:Multi-pass membrane protein
Mol. Mass.:68497.11
Organism:Homo sapiens (Human)
Description:Q01959
Residue:620
BDBM50373030
NameBDBM50373030
Synonyms:CHEMBL270099
TypeSmall organic molecule
Emp. Form.C19H21NO3S
Mol. Mass.343.44
SMILESCOC(=O)c1ccccc1S[C@H]([C@@H]1CNCCO1)c1ccccc1