Reaction Details
TargetSodium-dependent noradrenaline transporter
LigandBDBM50199005
Substrate/Competitorn/a
Meas. Tech.ChEMBL_466322 (CHEMBL947039)
Ki 0.95±n/a nM
Citation Zeng, FJarkas, NStehouwer, JSVoll, RJOwens, MJKilts, CDNemeroff, CBGoodman, MM Synthesis, in vitro characterization, and radiolabeling of reboxetine analogs as potential PET radioligands for imaging the norepinephrine transporter. Bioorg Med Chem16:783-93 (2008) 
 
Sodium-dependent noradrenaline transporter
Name:Sodium-dependent noradrenaline transporter
Type:Multi-pass membrane protein
Mol. Mass.:69337.72
Organism:Homo sapiens (Human)
Description:P23975
Residue:617
BDBM50199005
NameBDBM50199005
Synonyms:(S)-2-((S)-(2-methoxyphenoxy)(phenyl)methyl)morpholine | CHEMBL223166
TypeSmall organic molecule
Emp. Form.C18H21NO3
Mol. Mass.299.3642
SMILESCOc1ccccc1O[C@H]([C@@H]1CNCCO1)c1ccccc1