Reaction Details
TargetCarboxypeptidase A1
LigandBDBM50373037
Substrate/Competitorn/a
Meas. Tech.ChEMBL_466366 (CHEMBL932478)
Ki 790±n/a nM
Citation Wang, SHWang, SFXuan, WZeng, ZHJin, JYMa, JTian, GR Nitro as a novel zinc-binding group in the inhibition of carboxypeptidase A. Bioorg Med Chem16:3596-601 (2008) 
 
Carboxypeptidase A1
Name:Carboxypeptidase A1
Type:PROTEIN
Mol. Mass.:47132.61
Organism:Homo sapiens (Human)
Description:ChEMBL_1496378
Residue:419
BDBM50373037
NameBDBM50373037
Synonyms:CHEMBL261332
TypeSmall organic molecule
Emp. Form.C10H11NO4
Mol. Mass.209.1986
SMILESOC(=O)[C@@H](Cc1ccccc1)C[N+]([O-])=O