Reaction Details
TargetCell division protein ZipA
LigandBDBM50162321
Substrate/Competitorn/a
Meas. Tech.ChEMBL_466600 (CHEMBL925860)
Kd 83100±n/a nM
Citation Wells, JAMcClendon, CL Reaching for high-hanging fruit in drug discovery at protein-protein interfaces. Nature450:1001-1009 (2007) 
 
Cell division protein ZipA
Name:Cell division protein ZipA
Type:PROTEIN
Mol. Mass.:36470.34
Organism:Escherichia coli (strain K12)
Description:ChEMBL_466596
Residue:328
BDBM50162321
NameBDBM50162321
Synonyms:CHEMBL369180 N-Methyl-N-[3-(6-phenyl-[1,2,4]triazolo[4,3-b]pyridazin-3-yl)-phenyl]-acetamide | N-methyl-N-(3-(6-phenyl-[1,2,4]triazolo[4,3-b]pyridazin-3-yl)phenyl)acetamide
TypeSmall organic molecule
Emp. Form.C20H17N5O
Mol. Mass.343.3819
SMILESCN(C(C)=O)c1cccc(c1)-c1nnc2ccc(nn12)-c1ccccc1